cohort,ID,deliveryd,ogttweek,ogttwt,ogttweek1,hba1c1,hba1ca,hba1cweek,insulin,fbg_n,age,preg1,lab1,gage,deliverymode,ogtt0,ogtt1,ogtt2,GDM,height,preweight,weight_l,n_gender,wt_n,CHOL,TG,HDL,LDL,fbg1,week1,CHOL_B,TG_B,HDL_B,LDL_B,Fbgl,week3,pih,height1,weight_p,bmi,wtb1,lbw,macrosomia,gage1,stillbirth,gwg,preterm,csec,pih1,prec,lbw1,lbw2,bmi1,gwgc,rupture,FGR,hemo,distress,anemia,gender,g_age,wtb11,lga,SGA,fbgl,labc,adverse,familyh,familyd,gdmh,macroh,gwg2,gwg1,weekg1,weekg2,bmic,ogttl,ogttu,latel,lateu,wglatec,wg1c,hba1cac,pregc,nicu,glu,inter,hp,fbglate,choll,tgl,hdll,ldll,fbglc,head9,day12m,weight12,height12,bmi12,detafbg,detachol,detatg,detahdl,detaldl
2019,1,2019-04-27,24.571428571428573,64.0,24.0,,,,0,,39.57808219178082,4,1,27,4,5.08,7.96,9.36,1,161.0,56.0,63.5,女,1080,3.67,1.33,1.47,1.69,4.51,12.714285714285714,,,,,,,0,161.0,56.0,21.60410477990818,1080,1,0,27,0,7.5,1,0,0,0,1,1,21.60410477990818,1,1,0,1,0,0,2,27,1.08,,,,2,1,0,1,0,0,-0.5,8.0,24.0,3.0,2,4.699999999999999,8.0,1.0499999999999998,1.5,1.0,2.0,,2,0,,0,0,,,,,,,,,,,,,,,,
2019,2,2019-06-30,24.0,76.0,24.0,7.0,7.0,37.0,1,4.1,31.257534246575343,1,0,39,4,6.86,12.66,9.79,1,165.0,65.0,80.0,女,3990,3.9,2.13,1.39,1.92,4.72,12.142857142857142,3.37,5.2,0.91,0.85,7.91,34.714285714,0,165.0,65.0,23.875114784205692,3990,0,0,39,0,15.0,0,0,0,0,0,0,23.875114784205692,2,1,0,1,0,1,2,39,3.99,1.0,2.0,3.0,1,0,0,0,0,0,4.0,11.0,24.0,15.0,2,4.699999999999999,8.0,5.25,7.5,1.0,3.0,1.0,1,0,0.0,0,0,7.91,3.37,5.2,0.91,0.85,1.0,,0,,,,3.1900000000000004,-0.5299999999999998,3.0700000000000003,-0.47999999999999987,-1.0699999999999998
2020,3,2020-06-22,26.857142857142858,78.0,26.0,6.6,6.6,38.0,1,3.7,32.97534246575343,2,0,39,产钳,5.87,11.76,12.76,1,165.0,65.0,83.0,男,3600,6.11,2.51,1.37,3.91,4.72,6.857142857142857,8.52,11.59,1.3,2.2,5.73,34.857142857,0,165.0,65.0,23.875114784205692,3600,0,0,39,0,18.0,0,0,1,1,0,0,23.875114784205692,3,0,0,0,1,0,1,39,3.6,2.0,2.0,3.0,1,1,1,1,0,0,5.0,13.0,26.0,13.0,2,5.3999999999999995,9.0,4.55,6.5,2.0,3.0,1.0,2,0,0.0,0,0,5.73,8.52,11.59,1.3,2.2,1.0,43.5,2021-06-22 00:00:00,8.8,76.0,15.235457063711912,1.0100000000000007,2.4099999999999993,9.08,-0.07000000000000006,-1.71
2019,5,2019-07-04,23.857142857142858,68.0,24.0,6.5,6.5,35.0,0,4.1,31.197260273972603,1,0,40,1,5.5,8.81,6.81,1,160.0,55.0,71.0,男,3455,4.71,1.32,1.81,2.5,5.27,12.571428571428571,6.92,2.55,1.82,4.06,5.5,34.428571429,0,160.0,55.0,21.484375,3455,0,0,40,0,16.0,0,1,0,0,0,0,21.484375,2,1,0,1,0,0,1,40,3.455,2.0,2.0,3.0,1,0,0,0,0,0,3.0,13.0,24.0,16.0,2,4.699999999999999,8.0,5.6,8.0,1.0,3.0,1.0,1,0,0.0,0,0,5.5,6.92,2.55,1.82,4.06,1.0,,0,,,,0.23000000000000043,2.21,1.2299999999999998,0.010000000000000009,1.5599999999999996
2020,6,2020-06-28,24.857142857142858,80.0,25.0,6.4,6.4,32.1428571428571,1,4.8,40.68219178082192,1,0,39,剖宫产,8.28,14.21,11.23,1,158.0,76.7,87.5,男,3785,5.34,1.6,1.01,3.47,4.83,9.142857142857142,5.27,4.35,1.27,2.09,4.24,32.142857143,1,158.0,76.7,30.7242429097901,3785,0,0,39,0,10.799999999999997,0,1,1,0,0,0,30.7242429097901,3,0,0,0,0,0,1,39,3.785,2.0,2.0,2.0,1,0,0,0,0,0,7.5,3.299999999999997,25.0,14.0,4,2.71,5.51,2.3800000000000003,3.7800000000000002,3.0,2.0,1.0,1,0,0.0,0,0,4.24,5.27,4.35,1.27,2.09,0.0,46.3,2021-06-30 00:00:00,11.1,76.0,19.217451523545705,-0.5899999999999999,-0.07000000000000028,2.7499999999999996,0.26,-1.3800000000000003
2019,7,2019-05-26,24.0,74.0,26.0,6.4,6.4,37.0,0,,36.00821917808219,2,0,38,1,5.31,10.22,7.45,1,162.0,60.0,79.0,男,3770,5.25,0.59,1.85,2.79,5.2,8.142857142857142,7.64,2.56,2.7,4.28,4.87,37.0,1,162.0,60.0,22.86236854138089,3770,0,0,38,0,19.0,0,1,1,0,0,0,22.86236854138089,3,1,0,0,0,0,1,38,3.77,1.0,2.0,2.0,1,1,0,0,0,0,5.0,14.0,26.0,12.0,2,5.3999999999999995,9.0,4.199999999999999,6.0,2.0,3.0,1.0,2,0,,0,0,4.87,7.64,2.56,2.7,4.28,0.0,,2020-05-28 00:00:00,9.4,76.2,16.18892126673142,-0.33000000000000007,2.3899999999999997,1.9700000000000002,0.8500000000000001,1.4900000000000002
2019,8,2019-07-22,23.571428571428573,120.0,25.0,6.4,6.4,38.0,0,3.6,29.6,3,0,38,1,5.63,,,1,160.0,97.5,130.0,女,3945,3.85,1.56,1.27,2.2,4.94,9.142857142857142,,,,,,,1,160.0,97.5,38.0859375,3945,0,0,38,0,32.5,0,1,1,0,0,0,38.0859375,3,0,0,0,0,0,2,38,3.945,1.0,2.0,,1,0,1,0,0,0,10.0,22.5,25.0,13.0,4,2.71,5.51,2.21,3.5100000000000002,3.0,3.0,1.0,2,0,0.0,0,0,,,,,,,,2020-07-30 00:00:00,10.4,77.5,17.315296566077002,,,,,
2019,9,2019-06-28,26.714285714285715,26.0,89.0,6.4,6.4,39.0,0,3.0,36.02739726027397,2,1,40,4,4.39,9.09,8.52,1,170.0,78.0,93.0,男,4240,4.86,1.84,1.41,2.52,4.57,7.857142857142857,6.35,2.45,1.72,3.68,4.19,33.714285714,0,170.0,78.0,26.98961937716263,4240,0,1,40,0,15.0,0,0,0,0,0,0,26.98961937716263,3,0,0,0,0,0,1,40,4.24,1.0,2.0,2.0,2,0,1,0,0,0,,,,,3,,,,,,,1.0,2,0,0.0,0,0,4.19,6.35,2.45,1.72,3.68,0.0,,0,,,,-0.3799999999999999,1.4899999999999993,0.6100000000000001,0.31000000000000005,1.1600000000000001
2019,10,2019-05-20,26.714285714285715,57.0,26.0,6.3,6.3,40.0,0,4.7,32.364383561643834,3,0,40,2,5.25,7.61,6.23,1,160.0,46.0,56.0,男,3380,4.02,1.0,1.63,1.87,5.24,7.428571428571429,6.68,2.67,2.11,3.88,5.1,34.428571429,0,160.0,46.0,17.96875,3380,0,0,40,0,10.0,0,0,0,0,0,0,17.96875,1,0,0,0,1,0,1,40,3.38,2.0,2.0,3.0,1,1,0,0,0,0,-1.0,11.0,26.0,14.0,1,6.66,10.12,6.16,8.12,1.0,3.0,1.0,2,0,0.0,0,0,5.1,6.68,2.67,2.11,3.88,0.0,,0,,,,-0.14000000000000057,2.66,1.67,0.48,2.01
2020,11,2020-05-26,30.857142857142858,64.0,31.0,6.3,6.3,,1,,32.95068493150685,1,0,41,1,4.95,11.72,11.21,1,160.0,50.0,61.0,男,2960,5.44,1.6,1.36,3.73,4.43,10.571428571428571,7.38,3.03,1.5,4.71,4.68,33.142857143,0,160.0,50.0,19.53125,2960,0,0,41,0,11.0,0,1,0,0,0,0,19.53125,1,0,0,0,1,0,1,41,2.96,2.0,1.0,2.0,1,0,0,0,0,0,-3.0,14.0,31.0,10.0,2,7.1499999999999995,11.5,3.5,5.0,1.0,3.0,1.0,1,0,,1,0,4.68,7.38,3.03,1.5,4.71,0.0,,2021-05-21 00:00:00,9.3,77.0,15.685613088210493,0.25,1.9399999999999995,1.4299999999999997,0.1399999999999999,0.98
2020,13,2020-06-18,24.428571428571427,86.4,28.0,6.2,6.2,32.5714285714286,1,,33.04931506849315,2,0,38,剖宫产,5.36,12.09,8.2,1,163.0,68.0,88.0,女,3520,5.06,1.42,1.61,3.04,4.81,12.142857142857142,5.66,3.31,1.32,3.16,5.59,32.571428571,0,163.0,68.0,25.593737061989536,3520,0,0,38,0,20.0,0,1,1,1,0,0,25.593737061989536,3,0,0,1,0,0,2,38,3.52,1.0,2.0,3.0,1,1,0,0,0,0,1.5999999999999943,18.400000000000006,28.0,10.0,3,4.18,7.28,2.3000000000000003,3.3000000000000003,1.0,3.0,1.0,2,0,,1,0,5.59,5.66,3.31,1.32,3.16,1.0,43.0,2021-06-28 00:00:00,8.5,75.5,14.911626683040218,0.7800000000000002,0.6000000000000005,1.8900000000000001,-0.29000000000000004,0.1200000000000001
2020,15,2020-06-14,23.428571428571427,86.0,23.0,6.2,6.2,34.0,0,,31.293150684931508,1,0,38,自娩,5.41,9.44,7.06,1,168.0,75.0,95.0,女,3780,4.12,1.21,1.43,2.19,4.93,8.714285714285714,6.67,2.12,2.27,3.62,5.73,34.428571429,0,168.0,75.0,26.573129251700678,3780,0,0,38,0,20.0,0,0,0,0,0,0,26.573129251700678,3,1,0,0,1,0,2,38,3.78,1.0,2.0,3.0,1,0,0,0,0,0,9.0,11.0,23.0,15.0,3,3.0300000000000002,5.630000000000001,3.45,4.95,3.0,3.0,1.0,1,0,,0,0,5.73,6.67,2.12,2.27,3.62,1.0,,0,,,,0.8000000000000007,2.55,0.9100000000000001,0.8400000000000001,1.4300000000000002
2019,17,2019-06-30,25.142857142857142,57.0,24.0,6.2,6.2,36.0,0,4.2,32.44931506849315,3,0,39,4,5.39,11.69,7.74,1,160.0,52.0,65.0,女,3170,2.98,0.61,1.14,1.37,5.58,6.857142857142857,6.17,2.76,1.83,3.34,5.12,34.714285714,0,160.0,52.0,20.3125,3170,0,0,39,0,13.0,0,0,0,0,0,0,20.3125,2,1,0,0,0,1,2,39,3.17,2.0,2.0,3.0,1,1,0,0,0,0,8.0,5.0,24.0,15.0,2,4.699999999999999,8.0,5.25,7.5,3.0,2.0,1.0,2,0,0.0,0,0,5.12,6.17,2.76,1.83,3.34,0.0,,0,,,,-0.45999999999999996,3.19,2.15,0.6900000000000002,1.9699999999999998
2019,18,2019-07-26,23.714285714285715,25.0,74.0,6.2,6.2,38.0,1,,34.78630136986301,2,1,39,1,6.21,13.87,8.51,1,158.0,67.5,77.0,男,3485,3.58,1.14,1.42,1.55,5.07,8.857142857142858,5.08,3.53,1.64,2.17,4.65,33.428571429,0,158.0,67.5,27.03893606793783,3485,0,0,39,0,9.5,0,1,0,0,0,0,27.03893606793783,2,0,0,0,0,0,1,39,3.485,2.0,2.0,2.0,2,0,0,1,0,0,,,,,3,,,,,,,1.0,2,1,,0,0,4.65,5.08,3.53,1.64,2.17,0.0,,0,,,,-0.41999999999999993,1.5,2.3899999999999997,0.21999999999999997,0.6199999999999999
2020,20,2020-05-09,26.714285714285715,69.4,27.0,6.2,6.2,39.0,0,,33.47945205479452,1,0,39,2,4.92,8.11,9.45,1,158.0,57.0,77.0,女,3330,4.53,1.25,1.37,2.74,4.49,8.857142857142858,4.92,6.22,1.36,1.89,5.49,34.285714286,1,158.0,57.0,22.83287934625861,3330,0,0,39,0,20.0,0,0,1,0,0,0,22.83287934625861,3,1,0,0,0,1,2,39,3.33,2.0,2.0,3.0,1,0,1,1,0,0,7.599999999999994,12.400000000000006,27.0,12.0,2,5.75,9.5,4.199999999999999,6.0,3.0,3.0,1.0,1,0,,0,0,5.49,4.92,6.22,1.36,1.89,1.0,42.0,2021-05-20 00:00:00,7.4,72.0,14.274691358024691,1.0,0.3899999999999997,4.97,-0.010000000000000009,-0.8500000000000003
2020,21,2020-05-28,24.857142857142858,87.0,24.0,6.2,6.2,39.0,0,,31.06027397260274,1,0,39,4,5.36,7.62,6.97,1,168.0,81.0,88.0,男,3640,4.61,1.67,1.13,3.06,4.53,7.428571428571429,5.39,5.41,1.13,2.47,4.53,37.285714286,0,168.0,81.0,28.698979591836736,3640,0,0,39,0,7.0,0,0,1,1,0,0,28.698979591836736,2,0,0,1,0,0,1,39,3.64,2.0,2.0,2.0,1,0,1,0,0,0,1.0,6.0,24.0,15.0,3,3.2600000000000002,5.96,3.45,4.95,1.0,3.0,1.0,1,0,,0,0,4.53,5.39,5.41,1.13,2.47,0.0,48.0,2021-06-18 00:00:00,11.0,80.0,17.1875,0.0,0.7799999999999994,3.74,0.0,-0.5899999999999999
2019,22,2019-07-15,25.285714285714285,64.0,26.0,6.2,6.2,,0,,33.06301369863014,2,0,41,1,4.73,8.41,9.35,1,158.0,47.0,60.0,女,3195,4.6,1.1,1.62,2.79,4.67,9.0,7.41,1.69,1.93,4.91,,32.571428571,0,158.0,47.0,18.827111039897453,3195,0,0,41,0,13.0,0,1,0,0,0,0,18.827111039897453,2,1,0,0,0,1,2,41,3.195,2.0,2.0,,1,1,0,0,0,0,-4.0,17.0,26.0,15.0,2,5.3999999999999995,9.0,5.25,7.5,1.0,3.0,1.0,2,0,,0,0,,7.41,1.69,1.93,4.91,,,2020-07-15 00:00:00,9.8,77.0,16.528925619834713,,2.8100000000000005,0.5899999999999999,0.30999999999999983,2.12
2019,23,2019-06-25,25.428571428571427,66.0,26.0,6.2,6.2,,0,,30.778082191780822,3,0,40,4,4.2,10.3,8.75,1,160.0,57.0,70.0,女,3420,6.76,2.0,1.86,4.24,4.59,12.571428571428571,7.76,2.55,1.89,4.77,4.14,32.714285714,0,160.0,57.0,22.265624999999996,3420,0,0,40,0,13.0,0,0,0,0,0,0,22.265624999999996,2,1,0,0,0,0,2,40,3.42,2.0,2.0,2.0,1,1,0,0,0,0,4.0,9.0,26.0,14.0,2,5.3999999999999995,9.0,4.8999999999999995,7.0,1.0,2.0,1.0,2,0,,0,0,4.14,7.76,2.55,1.89,4.77,0.0,45.2,2020-06-27 00:00:00,8.9,74.0,16.2527392257122,-0.4500000000000002,1.0,0.5499999999999998,0.029999999999999805,0.5299999999999994
2019,24,2019-05-27,24.142857142857142,80.0,24.0,6.2,6.2,,0,,32.68767123287671,2,0,39,1,6.1,11.7,8.55,1,166.0,73.0,82.0,女,4250,3.4,0.98,1.26,1.5,5.42,9.142857142857142,5.57,2.38,1.7,3.09,4.88,33.285714286,0,166.0,73.0,26.49150820148062,4250,0,1,39,0,9.0,0,1,0,0,0,0,26.49150820148062,2,0,0,0,1,0,2,39,4.25,1.0,2.0,2.0,1,1,0,1,0,0,2.0,7.0,24.0,15.0,3,3.2600000000000002,5.96,3.45,4.95,1.0,3.0,1.0,2,0,,0,0,4.88,5.57,2.38,1.7,3.09,0.0,,2020-06-23 00:00:00,10.5,80.0,16.40625,-0.54,2.1700000000000004,1.4,0.43999999999999995,1.5899999999999999
2020,25,2020-05-13,27.142857142857142,67.0,26.0,6.2,6.050000000000001,36.5,1,4.1,33.42739726027397,1,0,39,1,5.12,12.23,7.54,1,162.0,57.0,76.4,女,2940,4.68,0.7,1.53,2.67,4.64,7.571428571428571,7.86,2.13,2.38,4.51,4.5,36.428571429,0,162.0,57.0,21.719250114311844,2940,0,0,39,0,19.400000000000006,0,1,0,0,0,0,21.719250114311844,3,1,0,0,1,0,2,39,2.94,2.0,2.0,2.0,1,0,1,0,0,0,9.400000000000006,10.0,26.0,13.0,2,5.3999999999999995,9.0,4.55,6.5,3.0,3.0,1.0,1,0,0.0,0,0,4.5,7.86,2.13,2.38,4.51,0.0,44.0,2021-05-13 00:00:00,9.1,73.6,16.799090264650285,-0.13999999999999968,3.1800000000000006,1.43,0.8499999999999999,1.8399999999999999
2020,26,2020-04-22,29.428571428571427,65.0,29.0,6.1,6.5,34.0,1,2.2,37.69041095890411,3,1,38,1,7.19,14.3,15.9,1,167.0,57.0,68.6,男,3285,5.98,3.56,1.52,3.11,5.11,13.142857142857142,8.13,4.62,1.65,4.54,4.55,34.428571429,0,167.0,57.0,20.43816558499767,3285,0,0,38,0,11.599999999999994,0,1,0,0,0,0,20.43816558499767,2,0,0,0,0,0,1,38,3.285,2.0,2.0,2.0,2,1,0,0,0,0,3.5999999999999943,8.0,29.0,9.0,2,6.449999999999999,10.5,3.15,4.5,2.0,2.0,1.0,2,0,1.0,1,0,4.55,8.13,4.62,1.65,4.54,0.0,45.7,2021-04-23 00:00:00,10.35,75.0,18.4,-0.5600000000000005,2.1500000000000004,1.06,0.1299999999999999,1.4300000000000002
2020,27,2020-07-11,24.571428571428573,60.2,24.0,6.1,6.1,28.0,0,4.2,33.397260273972606,2,1,29,自娩,4.37,9.28,8.71,1,163.0,56.0,63.0,男,1210,4.46,1.64,1.02,2.73,4.53,6.857142857142857,,,,,,,0,163.0,56.0,21.077195227520797,1210,1,0,29,0,7.0,1,0,0,0,1,1,21.077195227520797,1,1,0,0,1,1,1,29,1.21,,,,2,0,1,0,0,0,2.799999999999997,4.200000000000003,24.0,5.0,2,4.699999999999999,8.0,1.75,2.5,3.0,1.0,1.0,2,1,0.0,0,0,,,,,,,,2021-08-10 00:00:00,9.3,78.0,15.285996055226827,,,,,
2019,30,2019-06-17,26.714285714285715,59.5,26.0,6.1,6.1,35.0,0,3.4,31.035616438356165,5,1,36,4,4.86,10.2,10.95,1,160.0,47.0,60.0,男,3470,4.64,0.92,1.94,1.96,5.22,6.714285714285714,6.57,2.59,2.09,3.61,4.75,34.714285714,0,160.0,47.0,18.359375,3470,0,0,36,0,13.0,1,0,0,0,0,0,18.359375,2,1,0,0,1,0,1,36,3.47,1.0,2.0,2.0,2,0,0,0,0,0,0.5,12.5,26.0,10.0,1,6.66,10.12,4.4,5.8,1.0,3.0,1.0,2,0,0.0,0,0,4.75,6.57,2.59,2.09,3.61,0.0,,0,,,,-0.46999999999999975,1.9300000000000006,1.67,0.1499999999999999,1.65
2020,31,2020-05-16,26.571428571428573,60.0,27.0,6.1,6.1,39.0,0,4.3,29.621917808219177,1,0,40,4,4.25,10.01,6.2,1,160.0,47.0,64.0,女,3550,4.7,1.5,1.31,3.0,4.21,11.0,7.38,4.33,1.49,4.55,5.24,32.142857143,0,160.0,47.0,18.359375,3550,0,0,40,0,17.0,0,0,0,0,0,0,18.359375,2,1,0,0,0,0,2,40,3.55,2.0,2.0,3.0,1,0,0,1,0,0,4.0,13.0,27.0,13.0,1,7.1,10.7,5.72,7.539999999999999,1.0,3.0,1.0,1,0,0.0,0,0,5.24,7.38,4.33,1.49,4.55,0.0,43.5,2021-05-29 00:00:00,10.0,77.5,16.64932362122789,1.0300000000000002,2.6799999999999997,2.83,0.17999999999999994,1.5499999999999998
2019,32,2019-06-01,23.0,58.0,23.0,6.1,6.1,,1,,36.62191780821918,4,1,35,1,5.86,13.02,9.52,1,155.0,44.0,74.0,男,3345,5.37,1.3,1.86,3.09,4.53,9.571428571428571,7.09,2.71,2.01,4.26,4.24,32.428571429,0,155.0,44.0,18.314255983350677,3345,0,0,35,0,30.0,1,1,0,0,0,0,18.314255983350677,3,0,0,0,0,0,1,35,3.345,1.0,2.0,2.0,2,1,0,0,0,0,16.0,14.0,23.0,12.0,1,5.34,8.379999999999999,5.28,6.959999999999999,3.0,3.0,1.0,2,1,,0,0,4.24,7.09,2.71,2.01,4.26,0.0,,0,,,,-0.29000000000000004,1.7199999999999998,1.41,0.1499999999999997,1.17
2019,33,2019-07-30,24.142857142857142,64.0,27.0,6.1,6.1,,0,,30.205479452054796,2,0,39,4,5.29,9.62,7.54,1,158.0,58.0,68.0,男,4070,4.53,1.52,1.46,2.61,5.57,13.428571428571429,5.24,2.72,1.51,2.68,5.0,32.714285714,0,158.0,58.0,23.23345617689473,4070,0,1,39,0,10.0,0,0,0,0,0,0,23.23345617689473,1,1,0,0,0,0,1,39,4.07,1.0,2.0,2.0,1,1,0,0,0,0,4.0,6.0,27.0,12.0,2,5.75,9.5,4.199999999999999,6.0,1.0,2.0,1.0,2,0,,1,0,5.0,5.24,2.72,1.51,2.68,0.0,46.0,2020-07-30 00:00:00,10.3,75.0,18.311111111111114,-0.5700000000000003,0.71,1.2000000000000002,0.050000000000000044,0.07000000000000028
2019,34,2019-06-28,25.285714285714285,82.0,28.0,6.1,6.1,,1,,28.405479452054795,1,0,39,1,5.94,12.01,9.7,1,163.0,75.0,79.0,女,3425,5.43,1.4,1.38,3.28,5.53,7.857142857142857,6.65,3.1,2.11,3.44,5.25,32.714285714,0,163.0,75.0,28.228386465429637,3425,0,0,39,0,4.0,0,1,0,0,0,0,28.228386465429637,1,1,0,0,0,0,2,39,3.425,2.0,2.0,3.0,1,0,0,1,0,0,-3.0,7.0,28.0,11.0,3,4.18,7.28,2.5300000000000002,3.6300000000000003,1.0,2.0,1.0,1,0,,0,0,5.25,6.65,3.1,2.11,3.44,0.0,,2020-07-03 00:00:00,9.4,73.5,17.400157341848306,-0.28000000000000025,1.2200000000000006,1.7000000000000002,0.73,0.16000000000000014
2019,35,2019-07-24,26.285714285714285,81.0,26.0,6.1,6.05,34.0,1,3.9,30.197260273972603,1,0,39,1,4.59,10.93,10.17,1,160.0,65.0,84.0,男,3630,4.43,1.74,1.69,2.14,5.22,16.714285714285715,5.81,3.1,1.85,2.93,4.08,34.714285714,0,160.0,65.0,25.390625,3630,0,0,39,0,19.0,0,1,0,0,0,0,25.390625,3,1,0,1,1,1,1,39,3.63,2.0,2.0,2.0,1,0,0,1,0,0,3.0,16.0,26.0,13.0,3,3.72,6.62,2.99,4.29,2.0,3.0,1.0,1,0,0.0,0,0,4.08,5.81,3.1,1.85,2.93,0.0,44.5,2020-07-31 00:00:00,11.0,79.0,17.625380547989103,-1.1399999999999997,1.38,1.36,0.16000000000000014,0.79
2019,36,2019-06-27,26.285714285714285,74.0,27.0,6.1,6.0,37.0,1,3.7,30.52054794520548,1,0,39,4,5.82,9.68,6.81,1,163.0,60.0,77.0,男,3710,5.41,2.1,1.88,3.0,5.15,12.714285714285714,7.75,3.72,1.75,4.5,5.63,34.714285714,0,163.0,60.0,22.582709172343712,3710,0,0,39,0,17.0,0,0,0,0,0,0,22.582709172343712,3,1,0,0,0,0,1,39,3.71,2.0,2.0,3.0,1,0,1,0,0,0,3.0,14.0,27.0,12.0,2,5.75,9.5,4.199999999999999,6.0,1.0,3.0,1.0,1,0,0.0,0,0,5.63,7.75,3.72,1.75,4.5,1.0,,0,,,,0.47999999999999954,2.34,1.62,-0.1299999999999999,1.5
2019,37,2019-07-31,24.142857142857142,81.5,24.0,6.0,6.0,30.0,0,3.4,40.00547945205479,3,1,38,4,4.29,9.6,8.68,1,163.0,77.0,85.0,女,3600,3.45,0.77,1.35,1.88,4.68,7.0,4.12,2.41,1.55,1.85,4.8,32.0,0,163.0,77.0,28.981143437841094,3600,0,0,38,0,8.0,0,0,0,0,0,0,28.981143437841094,2,1,0,0,0,0,2,38,3.6,1.0,2.0,2.0,2,1,1,1,0,0,3.5,4.5,24.0,14.0,3,3.2600000000000002,5.96,3.22,4.62,2.0,2.0,1.0,2,0,0.0,0,0,4.8,4.12,2.41,1.55,1.85,0.0,,2020-07-17 00:00:00,9.6,77.6,15.942183016261028,0.1200000000000001,0.6699999999999999,1.6400000000000001,0.19999999999999996,-0.029999999999999805
2019,38,2019-06-19,24.857142857142858,72.3,28.0,6.0,6.0,30.0,0,5.6,30.44109589041096,1,0,40,4,6.2,13.18,10.85,1,163.0,58.0,78.0,男,3460,4.14,0.95,1.16,2.38,4.46,6.857142857142857,5.15,2.33,1.7,2.72,4.71,35.428571429,0,163.0,58.0,21.82995219993225,3460,0,0,40,0,20.0,0,0,0,0,0,0,21.82995219993225,3,0,0,0,0,0,1,40,3.46,2.0,2.0,2.0,1,0,0,0,0,0,5.700000000000003,14.299999999999997,28.0,12.0,2,6.1,10.0,4.199999999999999,6.0,2.0,3.0,1.0,1,0,0.0,0,0,4.71,5.15,2.33,1.7,2.72,0.0,,0,,,,0.25,1.0100000000000007,1.3800000000000001,0.54,0.3400000000000003
2020,39,2020-05-06,24.857142857142858,80.0,25.0,6.0,6.0,31.0,0,3.4,31.594520547945205,1,0,38,1,5.42,11.86,8.88,1,157.0,75.0,88.0,男,3285,4.61,1.26,1.49,3.07,4.62,8.571428571428571,4.64,2.13,1.45,2.48,4.24,32.285714286,0,157.0,75.0,30.42719785792527,3285,0,0,38,0,13.0,0,1,1,1,0,0,30.42719785792527,3,0,0,0,0,0,1,38,3.285,2.0,2.0,2.0,1,0,1,1,0,0,8.0,5.0,25.0,13.0,4,2.71,5.51,2.21,3.5100000000000002,3.0,2.0,1.0,1,0,0.0,1,0,4.24,4.64,2.13,1.45,2.48,0.0,46.8,2021-05-06 00:00:00,10.8,80.0,16.875000000000004,-0.3799999999999999,0.02999999999999936,0.8699999999999999,-0.040000000000000036,-0.5899999999999999
2020,40,2020-07-08,25.142857142857142,87.3,25.0,6.0,6.0,33.0,1,2.7,43.99452054794521,2,0,39,剖宫产,5.03,10.18,8.57,1,166.0,85.0,87.8,男,4600,6.49,1.8,1.52,3.84,4.98,12.0,8.81,3.77,1.74,5.17,5.46,33.857142857,1,166.0,85.0,30.846276672956886,4600,0,1,39,0,2.799999999999997,0,1,1,0,0,0,30.846276672956886,1,0,0,0,0,0,1,39,4.6,1.0,2.0,3.0,1,1,1,0,0,0,0.5,2.299999999999997,25.0,14.0,4,2.71,5.51,2.3800000000000003,3.7800000000000002,1.0,1.0,1.0,2,0,0.0,1,0,5.46,8.81,3.77,1.74,5.17,1.0,46.5,2021-07-12 00:00:00,10.75,81.0,16.3846974546563,0.47999999999999954,2.3200000000000003,1.97,0.21999999999999997,1.33
2019,41,2019-05-09,24.285714285714285,74.0,24.0,6.0,6.0,37.0,0,,32.53972602739726,1,0,38,1,5.42,8.22,6.09,1,166.0,65.0,74.0,女,3270,4.71,0.92,1.49,2.56,5.36,9.142857142857142,6.64,2.19,1.85,4.19,4.83,36.0,0,166.0,65.0,23.588329220496444,3270,0,0,38,0,9.0,0,1,0,0,0,0,23.588329220496444,1,1,0,1,0,1,2,38,3.27,2.0,2.0,2.0,1,0,0,1,0,0,0.0,9.0,24.0,14.0,2,4.699999999999999,8.0,4.8999999999999995,7.0,1.0,3.0,1.0,1,0,,0,0,4.83,6.64,2.19,1.85,4.19,0.0,44.0,0,,,,-0.5300000000000002,1.9299999999999997,1.27,0.3600000000000001,1.6300000000000003
2020,42,2020-05-22,27.571428571428573,27.0,74.0,6.0,6.0,38.0,0,4.9,34.23835616438356,1,0,38,1,5.18,6.42,6.16,1,166.0,56.0,83.0,男,2975,4.35,0.85,1.45,2.43,4.22,7.857142857142857,6.92,3.04,2.03,3.9,4.92,33.571428571,0,166.0,56.0,20.322252866889244,2975,0,0,38,0,27.0,0,1,0,0,0,0,20.322252866889244,3,0,0,0,0,0,1,38,2.975,2.0,2.0,2.0,1,0,1,0,0,0,,,,,2,,,,,,,1.0,1,0,0.0,0,0,4.92,6.92,3.04,2.03,3.9,0.0,44.2,2021-06-02 00:00:00,9.1,76.5,15.54957494980563,0.7000000000000002,2.5700000000000003,2.19,0.5799999999999998,1.4699999999999998
2020,43,2020-04-28,24.142857142857142,79.3,26.0,6.0,6.0,38.0,0,,36.25753424657534,3,1,38,1,5.42,10.31,7.87,1,168.0,73.0,86.5,女,2900,5.33,1.5,1.45,3.6,5.19,6.857142857142857,5.93,4.23,1.71,3.35,5.24,34.142857143,1,168.0,73.0,25.864512471655328,2900,0,0,38,0,13.5,0,1,1,0,0,0,25.864512471655328,3,0,0,0,0,0,2,38,2.9,2.0,2.0,3.0,2,1,1,1,1,0,7.200000000000003,6.299999999999997,26.0,12.0,3,3.72,6.62,2.7600000000000002,3.96,3.0,2.0,1.0,2,0,,1,0,5.24,5.93,4.23,1.71,3.35,0.0,44.5,2021-04-28 00:00:00,9.0,77.0,15.17962556923596,0.04999999999999982,0.5999999999999996,2.7300000000000004,0.26,-0.25
2020,44,2020-04-17,27.571428571428573,66.0,27.0,6.0,6.0,38.0,0,3.1,37.26575342465753,2,0,38,1,5.07,9.79,8.6,1,166.0,52.0,65.0,女,3465,5.83,0.7,1.96,3.5,4.68,9.0,6.63,4.07,1.51,3.36,4.97,34.571428571,0,166.0,52.0,18.870663376397154,3465,0,0,38,0,13.0,0,1,0,0,0,0,18.870663376397154,2,1,0,0,0,1,2,38,3.465,2.0,2.0,2.0,1,0,0,0,0,0,-1.0,14.0,27.0,11.0,2,5.75,9.5,3.8499999999999996,5.5,1.0,3.0,1.0,2,0,0.0,0,0,4.97,6.63,4.07,1.51,3.36,0.0,,0,,,,0.29000000000000004,0.7999999999999998,3.37,-0.44999999999999996,-0.14000000000000012
2019,45,2019-05-30,24.714285714285715,67.5,24.0,6.0,6.0,39.0,0,3.9,30.443835616438356,1,0,39,4,4.84,12.25,10.51,1,165.0,61.0,68.0,女,3570,5.57,1.3,1.76,3.09,4.53,8.571428571428571,6.81,2.85,1.78,3.85,3.74,34.714285714,0,165.0,61.0,22.4058769513315,3570,0,0,39,0,7.0,0,0,0,0,0,0,22.4058769513315,1,1,0,1,0,1,2,39,3.57,2.0,2.0,2.0,1,0,1,0,0,0,0.5,6.5,24.0,15.0,2,4.699999999999999,8.0,5.25,7.5,1.0,2.0,1.0,1,0,0.0,0,0,3.74,6.81,2.85,1.78,3.85,0.0,,0,,,,-0.79,1.2399999999999993,1.55,0.020000000000000018,0.7600000000000002
2020,46,2020-06-25,26.857142857142858,54.0,26.0,6.0,6.0,39.0,0,2.3,29.315068493150687,1,0,39,自娩,4.84,10.32,5.9,1,156.0,47.0,57.0,女,4150,4.83,0.91,1.64,2.54,4.35,8.857142857142858,9.06,3.04,1.72,5.87,4.73,34.857142857,0,156.0,47.0,19.312952005259696,4150,0,1,39,0,10.0,0,0,0,0,0,0,19.312952005259696,1,0,0,0,0,1,2,39,4.15,1.0,2.0,2.0,1,0,0,0,0,0,3.0,7.0,26.0,13.0,2,5.3999999999999995,9.0,4.55,6.5,1.0,2.0,1.0,1,0,1.0,0,0,4.73,9.06,3.04,1.72,5.87,0.0,45.7,2021-06-10 00:00:00,9.9,76.0,17.139889196675902,0.3800000000000008,4.23,2.13,0.08000000000000007,3.33
2019,48,2019-07-10,24.428571428571427,57.5,26.0,6.0,6.0,,0,,37.43561643835616,1,0,39,1,4.9,10.58,10.26,1,155.0,52.0,62.0,女,3880,4.11,1.43,1.54,2.05,5.0,7.142857142857143,5.81,3.77,1.57,2.87,4.11,33.0,0,155.0,52.0,21.64412070759625,3880,0,0,39,0,10.0,0,1,1,1,0,0,21.64412070759625,1,1,0,1,0,0,2,39,3.88,1.0,2.0,2.0,1,0,0,0,0,0,4.5,5.5,26.0,13.0,2,5.3999999999999995,9.0,4.55,6.5,1.0,2.0,1.0,1,0,,0,0,4.11,5.81,3.77,1.57,2.87,0.0,45.0,0,,,,-0.8899999999999997,1.6999999999999993,2.34,0.030000000000000027,0.8200000000000003
2019,49,2019-06-28,24.714285714285715,87.0,24.0,5.9,5.95,,0,,40.45479452054794,3,1,39,4,5.54,9.21,7.17,1,178.0,70.0,90.0,男,4240,4.56,0.83,1.63,2.55,5.13,7.714285714285714,6.78,2.06,1.49,4.33,5.45,33.142857143,0,178.0,70.0,22.093170054286073,4240,0,1,39,0,20.0,0,0,0,0,0,0,22.093170054286073,3,0,0,0,0,1,1,39,4.24,1.0,2.0,3.0,2,1,0,0,0,0,3.0,17.0,24.0,15.0,2,4.699999999999999,8.0,5.25,7.5,1.0,3.0,1.0,2,0,,0,0,5.45,6.78,2.06,1.49,4.33,1.0,,0,,,,0.3200000000000003,2.2200000000000006,1.23,-0.1399999999999999,1.7800000000000002
2019,50,2019-07-11,26.857142857142858,68.0,27.0,5.9,5.95,,1,,30.602739726027398,1,0,39,1,4.97,10.95,11.01,1,155.0,58.0,66.0,男,3030,3.87,0.8,1.19,2.3,4.53,7.428571428571429,5.04,3.05,1.33,2.6,4.45,32.857142857,0,155.0,58.0,24.14151925078044,3030,0,0,39,0,8.0,0,1,0,0,0,0,24.14151925078044,1,0,0,0,1,0,1,39,3.03,2.0,2.0,2.0,1,0,0,0,0,0,-2.0,10.0,27.0,12.0,2,5.75,9.5,4.199999999999999,6.0,1.0,3.0,1.0,1,0,,0,0,4.45,5.04,3.05,1.33,2.6,0.0,45.0,2020-07-15 00:00:00,8.8,77.0,14.842300556586272,-0.08000000000000007,1.17,2.25,0.14000000000000012,0.30000000000000027